{"text_format":"1","workbook":"xlsx","n_sheets":4,"sheets":["Inventory Certification","Inventory Control Report","FIFO Validation","Working Area"],"not_rendered":{"charts":0,"images":1,"macros":0,"external_links":0,"defined_names":12,"comments":3,"pivot_tables":1},"unopened":[],"bounds":{"document_bytes":16777216,"sheet_cells":100000,"rows_first":2000,"rows_last":500,"rows_between":2000,"halvings":0,"cell_chars":16384,"cell_head_chars":4096},"cells_cut":0,"cells_raw":0,"read":"whole","date_system":"1900"}

{"sheet":"Inventory Certification","index":0,"n_rows":58,"n_cols":57,"rows_kept":58,"cut":false,"hidden":false,"merged":[[54,2,54,6],[56,2,56,6],[1,0,1,13],[35,0,41,14],[57,2,57,6],[45,2,45,6],[47,2,47,6],[50,2,50,6],[50,13,50,14],[53,2,53,6],[53,13,53,14],[32,0,32,6],[32,11,32,14],[46,2,46,6],[46,13,46,14],[44,2,44,6],[44,13,44,14],[26,0,26,11],[26,13,26,14],[28,0,28,11],[30,0,30,6],[30,11,30,14],[7,11,7,13],[9,11,9,13],[21,9,23,12],[25,9,25,12],[11,11,11,13],[13,4,15,9],[13,11,15,13]]}
[]
["INVENTORY NIL CERTIFICATION - Q2 - 30th  JUNE 2015",null,null,null,null,null,null,null,null,null,null,null,null,null,null,null,null,null,null,null,null,null,null,null,null,null,null,null,null,null,null,null,null,null,null,null,null,null,null,null,null,null,null,null,null,null,null,null,null,null,null,null,null,"NGF","GF","OS","PUB"]
[null,null,null,null,null,null,null,null,null,null,null,null,null,null,null,null,null,null,null,null,null,null,null,null,null,null,null,null,null,null,null,null,null,null,null,null,null,null,null,null,null,null,null,null,null,null,null,null,null,null,null,null,null,"…","…","…","…"]
[null,null,null,null,null,null,null,null,null,null,null,null,null,null,null,null,null,null,null,null,null,null,null,null,null,null,null,null,null,null,null,null,null,null,null,null,null,null,null,null,null,null,null,null,null,null,null,null,null,null,null,null,null,"Item held for UNDP office's administrative use.","Item held for UNDP office's administrative use.","Item held for UNDP office's administrative use.","Item held for UNDP office's administrative use."]
[]
["Inventory Certification Type",null,null,null,"Reported project classification",null,null,null,null,null,null,"Reported Project IDs",null,null,null,null,null,null,null,null,null,null,null,null,null,null,null,null,null,null,null,null,null,null,null,null,null,null,null,null,null,null,null,null,null,null,null,null,null,null,null,null,null,"Item held by a DIM project for distribution to a beneficiary under a program mandate","Item held by a DIM project for distribution to a beneficiary under a program mandate","Item held by a DIM project for distribution to a beneficiary under a program mandate","Item held by a DIM project for distribution to a beneficiary under a program mandate"]
[null,null,{"$f":"IF(A2=\"OFFICE SUPPLIES AND FUELS CERTIFICATION - Q3 - 30th  SEPTEMBER 2014\",\"( Please make a CHECK mark close to the category where applicable )\",\"\")","v":""},null,null,null,null,null,null,null,null,null,null,null,null,null,null,null,null,null,null,null,null,null,null,null,null,null,null,null,null,null,null,null,null,null,null,null,null,null,null,null,null,null,null,null,null,null,null,null,null,null,null,"Item \"temporarily\" held by UNDP to be distributed under a NIM / NGO project modality. ","Item held for distribution under a Global Fund project",null,"Item held for distribution under a Global Fund project"]
[null,"NON-GLOBAL FUND",null,null,null,"Existing project(s) reported in previous quarter",null,null,null,null,null,"00079948",null,null,null,null,null,null,null,null,null,null,null,null,null,null,null,null,null,null,null,null,null,null,null,null,null,null,null,null,null,null,null,null,null,null,null,null,null,null,null,null,null,"Item held by UNDP for distribution to or on behalf of  other UN agencies under common services project","Item \"temporarily\" held by UNDP to be distributed under a NIM / NGO project modality. ",null,"Item \"temporarily\" held by UNDP to be distributed under a NIM / NGO project modality. "]
[]
[null,"GLOBAL FUND",null,null,null,"Transfer from closed project(s)",null,null,null,null,null,null,null,null,null,null,null,null,null,null,null,null,null,null,null,null,null,null,null,null,null,null,null,null,null,null,null,null,null,null,null,null,null,null,null,null,null,null,null,null,null,null,null,"Items held for distribution under full support to NIM ","Item held by UNDP for distribution to or on behalf of  other UN agencies under common services project",null,"Item held by UNDP for distribution to or on behalf of  other UN agencies under common services project"]
[]
[null,"PUBLICATIONS ",null,null,null,"New project(s)",null,null,null,null,null,null,null,null,null,null,null,null,null,null,null,null,null,null,null,null,null,null,null,null,null,null,null,null,null,null,null,null,null,null,null,null,null,null,null,null,null,null,null,null,null,null,null,"Publications held for free distribution","Items held for distribution under full support to NIM ",null,"Items held for distribution under full support to NIM "]
[]
[null,"OFFICE SUPPLIES & FUEL",null,null,"List of closed projects where inventory where transferred from",null,null,null,null,null,null,null,null,null,null,null,null,null,null,null,null,null,null,null,null,null,null,null,null,null,null,null,null,null,null,null,null,null,null,null,null,null,null,null,null,null,null,null,null,null,null,null,null,"Publications held for sale ","Publications held for free distribution",null,"Publications held for free distribution"]
[]
[null,"OFFICE SUPPLIES ONLY"]
[]
[null,"FUEL ONLY",null,null,null,null,null,null,null,null,null,null,null,null,null,null,null,null,null,null,null,null,null,null,null,null,null,null,null,null,null,null,null,null,null,null,null,null,null,null,null,null,null,null,null,null,null,null,null,null,null,null,null,null,"Publications held for sale ",null,"Publications held for sale "]
[]
[]
[]
[null,null,null,null,null,null,null,null,null,{"$f":"+'Inventory Control Report'!N8","v":"00079948"}]
["Project ID:"]
[]
[]
["Country Office:",null,null,null,null,null,null,null,null,{"$f":"+'Inventory Control Report'!N7","v":"Kuwait"}]
[]
["Actual Date of Physical Count undertaken/ completed:",null,null,null,null,null,null,null,null,{"$f":"+'Inventory Control Report'!J7","v":"2015-06-30"}]
[]
["Total Value ( USD) of the Inventory per Inventory Control Report submitted:",null,null,null,null,null,null,null,null,{"$f":"IF(OR(A2='Working Area'!P4,A2='Working Area'!P10),0,'Inventory Control Report'!AN65)","v":0}]
{"$rows_left_out":29}
{"sheet":"Inventory Control Report","index":1,"n_rows":65,"n_cols":40,"rows_kept":65,"cut":false,"hidden":false,"merged":[[64,1,64,16],[6,13,6,14],[7,13,7,15],[10,35,10,37],[10,22,10,24],[6,9,6,11],[7,9,7,11],[9,3,9,11],[10,3,10,11],[6,4,6,7]]}
[]
[null,null,null,null,null,null,null,null,null,null,null,null,null,null,"INVENTORY CONTROL REPORT - JUNE 2015"]
[]
[]
[]
[]
[null,null,null,null,"Actual date of the completion of the physical count ",null,null,null,null,"2015-06-30",null,null,"Country Office:","Kuwait",null,{"$f":"VLOOKUP(N7,'Working Area'!$J$3:$K$230,2,FALSE)","v":"KWT"}]
[null,null,null,null,"Submission type (use drop down menu)",null,null,null,null,"…",null,null,"Project ID","00079948",null,null,{"$f":"IF(J8=\"Non Global Fund\",\"NGF\",IF(J8=\"Office Supplies and Fuel\",\"OS\",IF(J8=\"Global Fund\",\"GF\",IF(J8=\"Publications\",\"PUB\",\"\"))))","v":""},{"$f":"IF(J8=\"Non Global Fund\",\"ICNGF\",IF(J8=\"Office Supplies and Fuel\",\"ICOS\",IF(J8=\"Global Fund\",\"ICGF\",IF(J8=\"Publications\",\"ICPUB\",\"\"))))","v":""}]
[]
[null,1,2,3,null,null,null,null,null,null,null,null,4,5,6,7,8,9,10,11,"12=9+10-11",null,13,14,"15=13+14","16=15-12","17=14",null,18,19,20,21,22,23,null,24,25,26,null,"27=23+26"]
[null,null,null,"Full COA Charged Per Item Reported ( spelling must be based on ATLAS record) ",null,null,null,null,null,null,null,null,null,"Please ensure that you select your Submission Type above to enable the drop down list based on the Inventory Category","Please ensure that you select your Submission Type above to enable the drop down list based on the Inventory Category",null,null,"This should be same as CLOSING BALANCE  REPORTED  AS AT 31 Mar 2015 (If you do not have details ask GSSC to send the worksheet for this project ). OPENING BALANCE (QTY)","Please read comment attached to this cell",null,null,null,"Physical Count Balance (QTY) as of 30 June 2015",null,null,null,"(Good and usable items only)  as of 30 June 2015",null,"Assume FIFO method Important: Please read carefully , the relevant section of the guidance note, before filling this column. Include all related costs ( actual or estimated).","(Assume FIFO method)","(Assume FIFO method)","(Assume FIFO method)","Important: This column seeks the current values of the items as at 30 June 2015. Please fill in this columns using the current market unit prices in equivalent USD. ( Please note : value in this column should market prices X qty in column 17 ) This will require collection of data from the markets / vendors/ LTA/Price bulletins / quotes / phone calls etc which have to be documented",null,null,"Inventory In Transit ( on FOB incoterms ) as of 30 June 2015"]
[null,"Count","Item Number (per Procurement Catalogue, if available)","Project ID \n(eg: 00012345)","Dept ID\n(eg: 23456)","Account \n(eg: 72505)","Donor \n(eg: 00012)","Fund \n(eg: 02300)","Implementing Agent\n(eg: 001981)","Oper Unit\n(eg: H17)","PC BU\n(eg: ABC10)","Activity ID  (as per ATLAS)","Item description (where possible please indicate the Brand or Model of items)","Item Category                             ( Select from the drop down)","Purpose of this item in storage location                                    (select from drop down menu)","Is this item a donated item to UNDP ?                        (select from drop down menu)","Unit of Measurement (select one from the display)","OPENING BALANCE  (QTY)","Quantity Received or transferred-in (since 31 Mar 2015)","Quantity Issued or transferred out or disposed  (since 31  Mar 2015)","Ending Balance (QTY) as per records, as of 30 June 2015",null,"Damaged, date expired, and unusable items","Good and usable items","Total","Difference between physical count in column 15 and the records in column 12                                        (Lost , stolen & unreconciled) ","QTY of Reportable Inventory Balance ",null,"Calculated \"Cost\" of the Inventory balance reported in column 17 or 14","PO No(s) Reference for the balance in column 18\n","Related Voucher No(s), for the balance in column 18)","Related GLJE ID(s), for the balance in column 18)","Valuation of inventory ","Reportable value of the inventory balance (Lower of column 18 and column 22)",null,"Quantity in transit (QTY)","ALTAS receipt ID","Purchase Value (in USD equivalent)",null,"Total value of  Inventories + Inventory In Transit"]
[null,1,null,"00079948",null,null,null,null,null,null,null,null,null,null,"…",null,null,null,null,null,{"$f":"R13+S13-T13","v":0},null,null,null,{"$f":"X13+W13","v":0},{"$f":"Y13-U13","v":0},{"$f":"X13","v":0},null,null,null,null,null,null,{"$f":"IF(AA13=0,0,IF(AG13=\"\",\"Col 22 cannot be left blank\", IF(AG13 = 0, \"Col 22 should not be zero\", IF(AC13<AG13,AC13,AG13))))","v":0},null,null,null,null,null,{"$f":"AH13+AL13","v":0}]
[null,{"$f":"B13+1","v":2},null,null,null,null,null,null,null,null,null,null,null,null,null,null,null,null,null,null,0,null,null,null,0,0,0,null,null,null,null,null,null,{"$f":"IF(AA14=0,0,IF(AG14=\"\",\"Col 22 cannot be left blank\", IF(AG14 = 0, \"Col 22 should not be zero\", IF(AC14<AG14,AC14,AG14))))","v":0},null,null,null,null,null,0]
[null,3,null,null,null,null,null,null,null,null,null,null,null,null,null,null,null,null,null,null,0,null,null,null,0,0,0,null,null,null,null,null,null,0,null,null,null,null,null,0]
[null,4,null,null,null,null,null,null,null,null,null,null,null,null,null,null,null,null,null,null,0,null,null,null,0,0,0,null,null,null,null,null,null,0,null,null,null,null,null,0]
[null,5,null,null,null,null,null,null,null,null,null,null,null,null,null,null,null,null,null,null,0,null,null,null,0,0,0,null,null,null,null,null,null,0,null,null,null,null,null,0]
[null,6,null,null,null,null,null,null,null,null,null,null,null,null,null,null,null,null,null,null,0,null,null,null,0,0,0,null,null,null,null,null,null,0,null,null,null,null,null,0]
[null,7,null,null,null,null,null,null,null,null,null,null,null,null,null,null,null,null,null,null,0,null,null,null,0,0,0,null,null,null,null,null,null,0,null,null,null,null,null,0]
[null,8,null,null,null,null,null,null,null,null,null,null,null,null,null,null,null,null,null,null,0,null,null,null,0,0,0,null,null,null,null,null,null,0,null,null,null,null,null,0]
[null,9,null,null,null,null,null,null,null,null,null,null,null,null,null,null,null,null,null,null,0,null,null,null,0,0,0,null,null,null,null,null,null,0,null,null,null,null,null,0]
[null,10,null,null,null,null,null,null,null,null,null,null,null,null,null,null,null,null,null,null,0,null,null,null,0,0,0,null,null,null,null,null,null,0,null,null,null,null,null,0]
[null,11,null,null,null,null,null,null,null,null,null,null,null,null,null,null,null,null,null,null,0,null,null,null,0,0,0,null,null,null,null,null,null,0,null,null,null,null,null,0]
[null,12,null,null,null,null,null,null,null,null,null,null,null,null,null,null,null,null,null,null,0,null,null,null,0,0,0,null,null,null,null,null,null,0,null,null,null,null,null,0]
[null,13,null,null,null,null,null,null,null,null,null,null,null,null,null,null,null,null,null,null,0,null,null,null,0,0,0,null,null,null,null,null,null,0,null,null,null,null,null,0]
[null,14,null,null,null,null,null,null,null,null,null,null,null,null,null,null,null,null,null,null,0,null,null,null,0,0,0,null,null,null,null,null,null,0,null,null,null,null,null,0]
[null,15,null,null,null,null,null,null,null,null,null,null,null,null,null,null,null,null,null,null,0,null,null,null,0,0,0,null,null,null,null,null,null,0,null,null,null,null,null,0]
[null,16,null,null,null,null,null,null,null,null,null,null,null,null,null,null,null,null,null,null,0,null,null,null,0,0,0,null,null,null,null,null,null,0,null,null,null,null,null,0]
[null,17,null,null,null,null,null,null,null,null,null,null,null,null,null,null,null,null,null,null,0,null,null,null,0,0,0,null,null,null,null,null,null,0,null,null,null,null,null,0]
[null,18,null,null,null,null,null,null,null,null,null,null,null,null,null,null,null,null,null,null,0,null,null,null,0,0,0,null,null,null,null,null,null,0,null,null,null,null,null,0]
{"$rows_left_out":36}
{"sheet":"FIFO Validation","index":2,"n_rows":72,"n_cols":16,"rows_kept":72,"cut":false,"hidden":false,"merged":[[18,1,18,10],[3,14,4,14],[3,15,4,15],[5,13,6,13],[5,14,6,14],[5,15,6,15],[3,13,4,13],[11,3,11,6],[10,3,10,6],[0,12,0,15],[2,1,2,10],[3,1,8,10],[10,8,10,9],[11,8,11,10]]}
[null,"FIFO Validation Sheet",null,null,null,null,null,null,null,null,null,null,"Example of FIFO Calculations"]
[null,null,null,null,null,null,null,null,null,null,null,null,"Count ID: 132","Units ","Price / Unit ","Value "]
[null,"This sheet is used to validate the FIFO Calculation for the 2 items with largest ending balance by value of the Inventory Control Report (Value $).                                                                                                                                                          ",null,null,null,null,null,null,null,null,null,null,"Balance in Hand ",50]
[null,"Calculation of “Cost” calculation of the reported inventory balances should be based on ‘vouchered’ amounts. Further, as per the IPSAS standard, the cost of Inventories must include all related costs of purchase , cost of conversion and other costs incurred in bringing the inventories to present location and condition. All costs incurred such as (i) the purchase price, (ii) import duties and other taxes (other than those subsequently recoverable by UNDP from the taxing authorities), (iii) transport costs (iv) handling costs and (v) other costs directly attributable to the acquisition of inventories have to be considered in calculating the cost of inventory balance. GMS has to be excluded. Therefore, all related vouchers should be considered for the cost of calculation of the inventory balances. If it is difficult to trace the related costs, please use some good measures of estimates and include to the cost calculated above and input in the column 18.                                                                                                                                                                                                                                                                                       ",null,null,null,null,null,null,null,null,null,null,"Last invoice ",30,5,150]
[null,null,null,null,null,null,null,null,null,null,null,null,"(bought 30 units) "]
[null,null,null,null,null,null,null,null,null,null,null,null,"2nd last invoice ",20,7,140]
[null,null,null,null,null,null,null,null,null,null,null,null,"(bought 40 units) "]
[null,null,null,null,null,null,null,null,null,null,null,null,"Total cost of item ‘A’ in hand at quarter-end** ",null,null,290]
[]
[]
[null,"Actual date of the completion of the physical count: ",null,{"$f":"+'Inventory Control Report'!J7","v":"2015-06-30"},null,null,null,"Country Office:",{"$f":"+'Inventory Control Report'!N7","v":"Kuwait"},null,{"$f":"VLOOKUP(I11,'Working Area'!$J$3:$K$230,2,FALSE)","v":"KWT"}]
[null,"Submission type ( use drop down menu):",null,{"$f":"+'Inventory Control Report'!J8","v":"…"},null,null,null,"Project ID","00079948 00075597"]
[]
[]
[null,null,null,"To be completed by CO / HQ unit Inventory Focal Point"]
[]
[null,"Column 18: Calculation of \"cost\" of physical count balance of good & usable items"]
[]
[null,"The “cost” of the inventory items on hand has to be based on FIFO approach (First in First out approach) and hence the prices of the latest purchases that will make up the physical balance have to be considered.  The values should be equivalent USD amounts as on the date of the Purchase. Please use the example next to this sheet as an example to fill the table below for the two largest items of the Inventory Control Report (in terms $ value per row). You can insert as many rows as needed for the calculation of the FIFO."]
[]
[null,"Sample for the first largest items in terms of value  ",null,null,null,null,null,"Sample for the second largest items in terms of value  "]
[null,"Count ID: ….","Units ","Price / Unit ","Value ",null,null,"Count ID: ….","Units ","Price / Unit ","Value "]
[null,"Balance in Hand ",null,null,null,null,null,"Balance in Hand "]
[null,"Invoice 1: ………. Units",null,null,{"$f":"+C24*D24","v":0},null,null,"Invoice 1: ………. Units",null,null,{"$f":"+I24*J24","v":0}]
[null,"Invoice 2: ………. Units",null,null,{"$f":"+C25*D25","v":0},null,null,"Invoice 2: ………. Units",null,null,{"$f":"+I25*J25","v":0}]
[null,"Invoice 3: ………. Units",null,null,0,null,null,"Invoice 3: ………. Units",null,null,0]
[null,"Invoice 4: ………. Units",null,null,0,null,null,"Invoice 4: ………. Units",null,null,0]
[null,"Cost of item in hand at quarter-end **",null,null,{"$f":"SUM(E24:E27)","v":0},null,null,"Cost of item in hand at quarter-end  **",null,null,{"$f":"SUM(K24:K27)","v":0}]
[]
[null,"** Only the values thus arrived (highlighted) has to be included in column 18. "]
{"$rows_left_out":43}
{"sheet":"Working Area","index":3,"n_rows":238,"n_cols":34,"rows_kept":238,"cut":false,"hidden":true,"merged":[[9,16,9,17],[11,16,11,17],[13,16,13,17]]}
[null,null,null,null,null,null,null,null,null,"OU Descr","OU"]
["OU Descr","OU",null,null,null,null,null,null,null,"…","…"]
["Advisory Comm. on Procurement","H31",null,null,null,null,null,null,null,"Advisory Comm. on Procurement","H31",null,null,null,null,"INVENTORY CERTIFICATION - Q2 - 30th  JUNE 2015"]
["Afghanistan","AFG",null,null,null,null,null,null,null,"Afghanistan","AFG",null,null,null,null,"INVENTORY NIL CERTIFICATION - Q2 - 30th  JUNE 2015"]
["Albania","ALB",null,null,null,null,null,null,null,"Albania","ALB"]
["Algeria","DZA",null,null,null,null,null,null,null,"Algeria","DZA"]
["Angola","AGO",null,null,null,null,null,null,null,"Angola","AGO"]
["Anguilla","AIA",null,null,null,null,null,null,null,"Anguilla","AIA"]
["Antigua and Barbuda","ATG",null,null,null,null,null,null,null,"Antigua and Barbuda","ATG"]
["Argentina","ARG",null,null,null,null,null,null,null,"Argentina","ARG"]
["Armenia","ARM",null,null,null,null,null,null,null,"Armenia","ARM",null,null,null,null,null,null,null,null,null,null,null,null,null,null,null,"ICNGF","ICGF","ICOS","ICPUB","NGF","GF","OS","PUB"]
["Aruba","ABW",null,null,null,null,null,null,null,"Aruba","ABW",null,null,null,null,null,"?",null,null,null,null,null,null,null,null,null,"…","…","…","…","…","…","…","…"]
["Azerbaijan","AZE",null,null,null,null,null,null,null,"Azerbaijan","AZE",null,null,null,null,null,null,null,null,null,null,null,null,null,null,null,"FUEL","MEDICAL","FUEL","HDR","Item held by a DIM project for distribution to a beneficiary under a program mandate","Item held by a DIM project for distribution to a beneficiary under a program mandate","Item held for UNDP office's administrative use.","Publications held for free distribution"]
["Bahamas","BHS",null,null,null,null,null,null,null,"Bahamas","BHS",null,null,null,null,null,"?",null,null,null,null,null,null,null,null,null,"MEDICAL","IT","MEDICAL","PUBLICATON","Item \"temporarily\" held by UNDP to be distributed under a NIM / NGO project modality. ","Item held for distribution under a Global Fund project","Item held by a DIM project for distribution to a beneficiary under a program mandate","Publications held for sale "]
["Bahrain","BHR",null,null,null,null,null,null,null,"Bahrain","BHR",null,null,null,null,null,null,null,null,null,null,null,null,null,null,null,"ELECTORAL","OTHERS","IT","OTHERS","Item held by UNDP for distribution to or on behalf of  other UN agencies under common services project","Item \"temporarily\" held by UNDP to be distributed under a NIM / NGO project modality. ","Item held for DIM project office administrative use."]
["Bangladesh","BGD",null,null,null,null,null,null,null,"Bangladesh","BGD",null,null,null,null,null,null,null,null,null,null,null,null,null,null,null,"CRISIS",null,"OFFICE",null,"Items held for distribution under full support to NIM ","Item held by UNDP for distribution to or on behalf of  other UN agencies under common services project"]
["Barbados","BRB",null,null,null,null,null,null,null,"Barbados","BRB",null,null,null,null,null,null,null,null,null,null,null,null,null,null,null,"IT",null,"OTHERS",null,"Items held for distribution on behalf of UNDSS ","Items held for distribution under full support to NIM "]
["BCPR","H10",null,null,null,null,null,null,null,"BCPR","H10",null,null,null,null,null,"?",null,null,null,null,null,null,null,null,null,"OFFICE",null,null,null,"Item held for DIM project office administrative use"]
["Belarus, Republic of","BLR",null,null,null,null,null,null,null,"Belarus, Republic of","BLR",null,null,null,null,null,null,null,null,null,null,null,null,null,null,null,"OTHERS",null,null,null,"Item distributed to beneficiaries but pending legal transfer"]
["Belize","BLZ",null,null,null,null,null,null,null,"Belize","BLZ"]
["Benin","BEN",null,null,null,null,null,null,null,"Benin","BEN"]
["Bermuda","BMU",null,null,null,null,null,null,null,"Bermuda","BMU",null,null,null,null,null,"This is to certify that , based on the Q2-2015 guidance on the physical count of the inventory  received from the UNDP HQ , there are no balances for the above selected inventory certification type(s) to be reported by the country office  as at 30 June 2015"]
["Bhutan","BTN",null,null,null,null,null,null,null,"Bhutan","BTN",null,null,null,null,null,"This is to certify that , based on the Q2-2015  physical count of the inventory carried out and the inventory reports submitted for the above project(s), the value of inventory balances reported as indicated above is accurate and complete , in accordance with the guidance note received from the UNDP HQ for the purpose.  This is to further certify that all the inventories that are in the  control of UNDP (including the inventory in transit under FOB incoterms ) have been included in this report . Their associated costs and valuations are calculated and reported correctly in accordance with the guidance note received . Any unreconciled differences in quantities  between physical count and local inventory records, if reported under column 16 of the Inventory Control Report , are being investigated for further actions."]
["Bolivia","BOL",null,null,null,null,null,null,null,"Bolivia","BOL"]
["BOM/Ofc of Asst Administrator","H22",null,null,null,null,null,null,null,"BOM/Ofc of Asst Administrator","H22",null,null,null,null,null,null,null,null,null,null,null,null,null,null,null,"Fuel",null,null,null,"Fuel"]
["Bosnia and Herzegovina","BIH",null,null,null,null,null,null,null,"Bosnia and Herzegovina","BIH",null,null,null,null,null,null,null,null,null,null,null,null,null,null,null," Medical",null,null,null," Medical"]
["Botswana","BWA",null,null,null,null,null,null,null,"Botswana","BWA",null,null,null,null,null,null,null,null,null,null,null,null,null,null,null," Electoral supplies ",null,null,null,"  Toners"]
["Bratislava Regional Center","SVK",null,null,null,null,null,null,null,"Bratislava Regional Center","SVK",null,null,null,null,null,null,null,null,null,null,null,null,null,null,null,"Crisis related",null,null,null," Other IT supplies"]
["Brazil","BRA",null,null,null,null,null,null,null,"Brazil","BRA",null,null,null,null,null,null,null,null,null,null,null,null,null,null,null," HDR reports",null,null,null," Visibility items "]
["Bulgaria","BGR",null,null,null,null,null,null,null,"Bulgaria","BGR",null,null,null,null,null,null,null,null,null,null,null,null,null,null,null,"Other publications",null,null,null," Office supplies and stationery"]
{"$rows_left_out":208}